{"text_format":"1","workbook":"xlsx","n_sheets":10,"sheets":["記入上の注意","参加申込書Ａ","参加申込書Ｂ","運営要員調査票","出品票作成","出品票","学校情報（これより右のシートは入力・印刷不要）","全種別","summary","summary (2)"],"not_rendered":{"charts":0,"images":1,"macros":1,"external_links":0,"defined_names":3,"comments":2,"pivot_tables":0},"unopened":[],"bounds":{"document_bytes":16777216,"sheet_cells":100000,"rows_first":2000,"rows_last":500,"rows_between":2000,"halvings":0,"cell_chars":16384,"cell_head_chars":4096},"cells_cut":0,"cells_raw":0,"read":"whole","date_system":"1904"}

{"sheet":"記入上の注意","index":0,"n_rows":23,"n_cols":5,"rows_kept":23,"cut":false,"hidden":false,"merged":[[23,1,23,4],[15,1,15,4],[7,1,7,4],[12,1,12,4],[18,1,18,4],[22,1,22,4],[20,1,20,4]]}
["記入上の注意"]
[]
[1,"このファイルはマクロを使用しています。"]
[null,null,"Windowsの場合…",null,"メッセージバー（黄色）にセキュリティの警告「マクロが無効にされました。」と表示された場合、「コンテンツの有効化」をクリックしてください。"]
[null,null,null,null,"「このファイルを信頼済みドキュメントにしますか？」と表示されますので「はい」を選択してください。"]
[null,null,"Macの場合………",null,"「マクロを無効にする」を選択した場合は、一度閉じて再度開き「マクロを有効にする」を選択してください。"]
[]
[2,"必要事項を入力後、印刷し参加申込書Ａ（様式１-①）に押印して美術・工芸専門部事務局にお送りください。"]
[null,null,"〒621-0812 亀岡市横町23"]
[null,null,"京都府立亀岡高等学校内　担当教論　吉田　睦"]
[null,null,"TEL・FAX  0771-22-0144 （普通科美術・工芸専攻職員室）"]
[]
[3,"入力後、このファイルをメールに添付して送信してください。\n（締め切り厳守）"]
[null,null,"E-mail","m-yoshida-15@kyoto-be.ne.jp"]
[]
{"$rows_left_out":9}
{"sheet":"参加申込書Ａ","index":1,"n_rows":40,"n_cols":5,"rows_kept":40,"cut":false,"hidden":false,"merged":[[6,1,6,4],[11,3,11,4],[32,0,32,4],[25,0,26,0],[1,0,1,4],[2,0,2,4],[5,1,5,4],[7,1,7,4],[8,3,8,4],[13,3,13,4],[10,3,10,4],[12,3,12,4],[15,3,15,4],[18,2,19,2],[39,0,39,4],[22,0,24,0],[31,3,31,4],[28,0,28,2],[20,2,21,2],[33,0,33,4],[22,2,24,2],[16,0,21,0]]}
["（様式１－①）",null,null,"学校No.",{"$f":"VLOOKUP($B$6,'学校情報（これより右のシートは入力・印刷不要）'!$E$2:$K$120,2,FALSE)","v":0}]
["第40回京都府高等学校総合文化祭"]
["美術・工芸部門参加申込書　Ａ"]
[]
["申込日","選択してください","月","選択してください","日"]
["学校名","選択してください"]
["校長名"]
["部活動名"]
["電話",{"$f":"VLOOKUP($B$6,'学校情報（これより右のシートは入力・印刷不要）'!$E$2:$K$120,6,FALSE)","v":"自動入力（上書入力可）"},"ＦＡＸ",{"$f":"VLOOKUP($B$6,'学校情報（これより右のシートは入力・印刷不要）'!$E$2:$K$120,7,FALSE)","v":"自動入力（上書入力可）"}]
[]
["指導教員","氏名","メールアドレス","携帯、スマホ"]
["1（主顧問：必須）"]
["2（副顧問：任意）"]
["3（副顧問：任意）"]
[]
{"$rows_left_out":26}
{"sheet":"参加申込書Ｂ","index":2,"n_rows":5,"n_cols":13,"rows_kept":5,"cut":false,"hidden":false,"merged":[[2,8,2,9],[2,6,3,6],[0,3,0,4],[1,1,1,3],[0,5,0,12],[2,11,2,12],[1,5,1,6],[1,8,1,10],[2,10,3,10],[2,0,3,0],[2,1,3,1],[2,2,2,3],[2,4,2,5],[2,7,3,7]]}
["（様式１－②）",null,null,"←Ａを入力後、最初に一度だけクリックしてください。再度クリックすると情報がリセットされます。",null,"美術・工芸部門参加申込書 Ｂ"]
["学校名",{"$f":"参加申込書Ａ!B6","v":"選択してください"},null,null,"指導教員名",{"$f":"参加申込書Ａ!B12","v":0},null,"連絡先",{"$f":"参加申込書Ａ!C12&CHAR(13)&\" , \"&参加申込書Ａ!D12","v":"\r , "},null,null,"作品点数",{"$f":"SUM(参加申込書Ａ!D17:D27)","v":0}]
["作品\n番号","学年","出品者名",null,"題　　　　名",null,"区分","種別","作品の大きさ",null,"コメント","参加確認"]
[null,null,"出品者名","ふりがな（出品者名）","題　　名","ふりがな（題名）",null,null,"作品の規格","平面：縦×横×厚さ\n立体：幅×奥行×高さ\n映像：動画形式、時間（分）\nアスペクト比",null,"開会式","講評会"]
[1,1,"作者１","さくしゃ１","作品１","さくひん１","平面","絵画","F50号縦",{"$f":"IF(I5=\"その他\",\"\",IF(I5=\"\",\"\",\"入力不要\"))","v":"入力不要"},"作者によるコメント（60文字以内）","実施なし","参加"]

{"sheet":"運営要員調査票","index":3,"n_rows":10,"n_cols":13,"rows_kept":10,"cut":false,"hidden":false,"merged":[[0,8,0,11],[0,4,0,7]]}
["（様式１－③）","運営要員調査票",null,"10月20日\n（金）","10月21日\n（土）",null,null,null,"10月22日\n（日）"]
[null,null,null,"搬入","受付","受付","受付","受付","受付","受付","受付","搬出"]
["指導教員","氏名","講評会講師","9:00\n～\n17:00","9:00\n～\n11:00","11:00\n～\n13:00","13:00\n～\n15:00","15:00\n～\n17:00","9:00\n～\n11:00","11:00\n～\n13:00","13:00\n～\n15:00","15:00\n～\n17:00","備考"]
["1（主顧問）",{"$f":"参加申込書Ａ!B12","v":0}]
["2（副顧問）",{"$f":"参加申込書Ａ!B13","v":0}]
["3（副顧問）",{"$f":"参加申込書Ａ!B14","v":0}]
[]
["記入上の注意"]
["・搬入、搬出には必ず１名以上参加してください。"]
["・芸術科(美術・工芸)の免許をお持ちの先生は講師として御協力をお願いします。"]

{"sheet":"出品票作成","index":4,"n_rows":21,"n_cols":3,"rows_kept":21,"cut":false,"hidden":false,"merged":[]}
["出品票作成"]
[]
["トラック運送計画が決まってから作成してください。"]
["作成の前に、プログラム校正用のPDFを参照して、参加申込書Ｂの「作品番号」を入力してください。"]
[]
["トラック","選択","号車"]
[]
["「号車」を選択してから以下のボタンを1回クリックしてください。"]
["作品数分の出品票（シート）が作成されます。"]
[]
[]
[]
[]
[]
["作成の後、写真を挿入してください。"]
{"$rows_left_out":7}
{"sheet":"出品票","index":5,"n_rows":11,"n_cols":6,"rows_kept":11,"cut":false,"hidden":false,"merged":[[8,1,8,3],[10,1,10,3],[1,3,2,3],[3,1,3,3],[4,1,4,3],[5,1,5,3],[6,1,6,3],[7,1,7,3]]}
["（様式２）　　　"]
["第40回京都府高等学校総合文化祭",null,"No.","美・工",null,"作品番号"]
["出  品  票",null,{"$f":"F3","v":1},null,null,{"$f":"参加申込書Ｂ!A5","v":1}]
["トラック",{"$f":"出品票作成!B6&\"号車\"","v":"選択号車"}]
["学校名",{"$f":"参加申込書Ａ!B6","v":"選択してください"}]
["ふりがな",{"$f":"VLOOKUP($F$3,参加申込書Ｂ!$A$5:$M$30,4,FALSE)","v":"さくしゃ１"}]
["出品者",{"$f":"VLOOKUP($F$3,参加申込書Ｂ!$A$5:$M$30,3,FALSE)","v":"作者１"}]
["ふりがな",{"$f":"VLOOKUP($F$3,参加申込書Ｂ!$A$5:$M$30,6,FALSE)","v":"さくひん１"}]
["題 名",{"$f":"VLOOKUP($F$3,参加申込書Ｂ!$A$5:$M$30,5,FALSE)","v":"作品１"}]
["区分",{"$f":"VLOOKUP($F$3,参加申込書Ｂ!$A$5:$M$30,7,FALSE)","v":"平面"},"種別",{"$f":"VLOOKUP($F$3,参加申込書Ｂ!$A$5:$M$30,8,FALSE)","v":"絵画"}]
["作品写真","「右クリック」→「画像の変更」で写真を挿入してください。\n作品が確認できる程度の画質で、歪みや傾きがあっても構いません。色調補正なども必要ありません。"]

{"sheet":"学校情報（これより右のシートは入力・印刷不要）","index":6,"n_rows":120,"n_cols":12,"rows_kept":120,"cut":false,"hidden":false,"merged":[]}
["整理番号","分類","学校名","美術・工芸","学校正式名","学校No","郵便番号","郵便番号ハイフンなし","住所","電話","FAX","E-mail"]
[0,"例","学校名",null,"選択してください",0,"　","　","　","自動入力（上書入力可）","自動入力（上書入力可）"]
[1,"国立","京都教育大学附属",12,"京都教育大学附属高等学校",1,"612-8431","6128431","京都市伏見区深草越後屋敷町111","075-641-9195","075-641-3871","kfkou1@kyokyo-u.ac.jp"]
[2,"府立","山城",27,"京都府立山城高等学校",2,"603-8335","6038335","京都市北区大将軍坂田町29","075-463-8261","075-463-8263","yamashiro-info@kyoto-be.ne.jp"]
[3,"府立","鴨沂",18,"京都府立鴨沂高等学校",3,"602-0867","6020867","京都市上京区寺町通荒神口下ル松蔭町131","075-231-1512","075-231-0220","ohki-hs@kyoto-be.ne.jp"]
[4,"府立","洛北",21,"京都府立洛北高等学校",4,"606-0851","6060851","京都市左京区下鴨梅ノ木町59","075-781-0020","075-781-2520","rakuhoku-hs@pref.kyoto.lg.jp"]
[5,"府立","北稜",19,"京都府立北稜高等学校",5,"606-0015","6060015","京都市左京区岩倉幡枝町2105番地","075-701-2900","075-722-8400"]
[6,"府立","朱雀",18,"京都府立朱雀高等学校",6,"604-8384","6048384","京都市中京区西ノ京式部町1","075-841-0127","075-841-0646","suzaku-hs-zen@kyoto-be.ne.jp"]
[7,"府立","洛東",18,"京都府立洛東高等学校",7,"607-8017","6078017","京都市山科区安朱川向町10","075-581-1124","075-581-1125"]
[8,"府立","鳥羽",22,"京都府立鳥羽高等学校",8,"601-8449","6018449","京都市南区西九条大国町1","075-672-6788","075-691-7448","toba-hs@kyoto-be.ne.jp"]
[9,"府立","嵯峨野",24,"京都府立嵯峨野高等学校",9,"616-8226","6168226","京都市右京区常盤段ノ上町15","075-871-0723","075-871-0724","sagano-hs@kyoto-be.ne.jp"]
[10,"府立","北嵯峨",21,"京都府立北嵯峨高等学校",10,"616-8353","6168353","京都市右京区嵯峨大沢柳井手町","075-872-1700","075-872-1701","kitasaga-hs@pref.kyoto.lg.jp"]
[11,"府立","北桑田",9,"京都府立北桑田高等学校",11,"601-0534","6010534","京都市右京区京北下弓削町沢ノ奥15","075-854-0022","075-854-0310","kitakuwada-hs@kyoto-be.ne.jp"]
[12,"府立","桂",27,"京都府立桂高等学校",12,"615-8102","6158102","京都市西京区川島松ノ木本町27","075-391-2151","075-391-2153","katsura-hs@pref.kyoto.lg.jp"]
[13,"府立","洛西",21,"京都府立洛西高等学校",13,"610-1146","6101146","京都市西京区大原野西境谷町1丁目12-1.2","075-332-0555","075-332-0216","rakusai-hs@pref.kyoto.lg.jp"]
{"$rows_left_out":106}
{"sheet":"全種別","index":7,"n_rows":13,"n_cols":13,"rows_kept":13,"cut":false,"hidden":false,"merged":[[0,11,0,12],[0,7,1,7],[0,0,1,0],[0,1,1,1],[0,2,0,3],[0,4,0,5],[0,8,0,9],[0,6,1,6],[0,10,1,10]]}
["作品\n番号","学年","出品者名",null,"題　　　　名",null,"区分","種別","作品の大きさ",null,"コメント","参加確認"]
[null,null,"出品者名","ふりがな（出品者名）","題　　名","ふりがな（題名）",null,null,"作品の規格","平面：縦×横×厚さ\n立体：幅×奥行×高さ\n映像：動画形式、時間（分）\nアスペクト比",null,"開会式","講評会"]
[null,null,null,null,null,null,"平面","絵画",null,{"$f":"IF(I3=\"その他\",\"\",IF(I3=\"\",\"\",\"入力不要\"))","v":""},null,"実施なし"]
[null,null,null,null,null,null,"平面","版画",null,{"$f":"IF(I4=\"その他\",\"\",IF(I4=\"\",\"\",\"入力不要\"))","v":""},null,"実施なし"]
[null,null,null,null,null,null,"平面","デザイン",null,{"$f":"IF(I5=\"その他\",\"\",IF(I5=\"\",\"\",\"入力不要\"))","v":""},null,"実施なし"]
[null,null,null,null,null,null,"平面","テーマ作品の部",null,{"$f":"IF(I6=\"その他\",\"\",IF(I6=\"\",\"\",\"入力不要\"))","v":""},null,"実施なし"]
[null,null,null,null,null,null,"平面",null,"その他",null,null,"実施なし"]
[null,null,null,null,null,null,"平面","彫刻","その他",null,null,"実施なし"]
[null,null,null,null,null,null,"立体","彫刻",null,null,null,"実施なし"]
[null,null,null,null,null,null,"立体","デザイン",null,null,null,"実施なし"]
[null,null,null,null,null,null,"立体",null,null,null,null,"実施なし"]
[null,null,null,null,null,null,"映像","スクリーン","その他",null,null,"実施なし"]
[null,null,null,null,null,null,"映像","空間","その他",null,null,"実施なし"]

{"sheet":"summary","index":8,"n_rows":30,"n_cols":28,"rows_kept":30,"cut":false,"hidden":false,"merged":[]}
["作品番号","学年","出品者名","ふりがな（出品者名）","題名","ふりがな（題名）","区分","種別","規格","サイズ","コメント","開会式","講評会","トラック号車","学校番号","学校名","電話","FAX","部名","指導教員名1","メールアドレス1","携帯1","指導教員名2","メールアドレス2","携帯2","指導教員名3","メールアドレス3","携帯3"]
[{"$f":"参加申込書Ｂ!A5","v":1},{"$f":"参加申込書Ｂ!B5","v":1},{"$f":"参加申込書Ｂ!C5","v":"作者１"},{"$f":"参加申込書Ｂ!D5","v":"さくしゃ１"},{"$f":"参加申込書Ｂ!E5","v":"作品１"},{"$f":"参加申込書Ｂ!F5","v":"さくひん１"},{"$f":"参加申込書Ｂ!G5","v":"平面"},{"$f":"参加申込書Ｂ!H5","v":"絵画"},{"$f":"参加申込書Ｂ!I5","v":"F50号縦"},{"$f":"参加申込書Ｂ!J5","v":"入力不要"},{"$f":"参加申込書Ｂ!K5","v":"作者によるコメント（60文字以内）"},{"$f":"参加申込書Ｂ!L5","v":"実施なし"},{"$f":"参加申込書Ｂ!M5","v":"参加"},{"$f":"出品票作成!$B$6","v":"選択"},{"$f":"参加申込書Ａ!$E$1","v":0},{"$f":"参加申込書Ａ!$B$6","v":"選択してください"},{"$f":"参加申込書Ａ!$B$9","v":"自動入力（上書入力可）"},{"$f":"参加申込書Ａ!$D$9","v":"自動入力（上書入力可）"},{"$f":"参加申込書Ａ!$B$8","v":0},{"$f":"参加申込書Ａ!$B$12","v":0},{"$f":"参加申込書Ａ!$C$12","v":0},{"$f":"参加申込書Ａ!$D$12","v":0},{"$f":"参加申込書Ａ!$B$13","v":0},{"$f":"参加申込書Ａ!$C$13","v":0},{"$f":"参加申込書Ａ!$D$13","v":0},{"$f":"参加申込書Ａ!$B$14","v":0},{"$f":"参加申込書Ａ!$C$14","v":0},{"$f":"参加申込書Ａ!$D$14","v":0}]
[{"$f":"参加申込書Ｂ!A6","v":0},{"$f":"参加申込書Ｂ!B6","v":0},{"$f":"参加申込書Ｂ!C6","v":0},{"$f":"参加申込書Ｂ!D6","v":0},{"$f":"参加申込書Ｂ!E6","v":0},{"$f":"参加申込書Ｂ!F6","v":0},{"$f":"参加申込書Ｂ!G6","v":0},{"$f":"参加申込書Ｂ!H6","v":0},{"$f":"参加申込書Ｂ!I6","v":0},{"$f":"参加申込書Ｂ!J6","v":0},{"$f":"参加申込書Ｂ!K6","v":0},{"$f":"参加申込書Ｂ!L6","v":0},{"$f":"参加申込書Ｂ!M6","v":0},{"$f":"出品票作成!$B$6","v":"選択"},{"$f":"参加申込書Ａ!$E$1","v":0},{"$f":"参加申込書Ａ!$B$6","v":"選択してください"},{"$f":"参加申込書Ａ!$B$9","v":"自動入力（上書入力可）"},{"$f":"参加申込書Ａ!$D$9","v":"自動入力（上書入力可）"},{"$f":"参加申込書Ａ!$B$8","v":0},{"$f":"参加申込書Ａ!$B$12","v":0},{"$f":"参加申込書Ａ!$C$12","v":0},{"$f":"参加申込書Ａ!$D$12","v":0},{"$f":"参加申込書Ａ!$B$13","v":0},{"$f":"参加申込書Ａ!$C$13","v":0},{"$f":"参加申込書Ａ!$D$13","v":0},{"$f":"参加申込書Ａ!$B$14","v":0},{"$f":"参加申込書Ａ!$C$14","v":0},{"$f":"参加申込書Ａ!$D$14","v":0}]
[{"$f":"参加申込書Ｂ!A7","v":0},{"$f":"参加申込書Ｂ!B7","v":0},{"$f":"参加申込書Ｂ!C7","v":0},{"$f":"参加申込書Ｂ!D7","v":0},{"$f":"参加申込書Ｂ!E7","v":0},{"$f":"参加申込書Ｂ!F7","v":0},{"$f":"参加申込書Ｂ!G7","v":0},{"$f":"参加申込書Ｂ!H7","v":0},{"$f":"参加申込書Ｂ!I7","v":0},{"$f":"参加申込書Ｂ!J7","v":0},{"$f":"参加申込書Ｂ!K7","v":0},{"$f":"参加申込書Ｂ!L7","v":0},{"$f":"参加申込書Ｂ!M7","v":0},{"$f":"出品票作成!$B$6","v":"選択"},{"$f":"参加申込書Ａ!$E$1","v":0},{"$f":"参加申込書Ａ!$B$6","v":"選択してください"},{"$f":"参加申込書Ａ!$B$9","v":"自動入力（上書入力可）"},{"$f":"参加申込書Ａ!$D$9","v":"自動入力（上書入力可）"},{"$f":"参加申込書Ａ!$B$8","v":0},{"$f":"参加申込書Ａ!$B$12","v":0},{"$f":"参加申込書Ａ!$C$12","v":0},{"$f":"参加申込書Ａ!$D$12","v":0},{"$f":"参加申込書Ａ!$B$13","v":0},{"$f":"参加申込書Ａ!$C$13","v":0},{"$f":"参加申込書Ａ!$D$13","v":0},{"$f":"参加申込書Ａ!$B$14","v":0},{"$f":"参加申込書Ａ!$C$14","v":0},{"$f":"参加申込書Ａ!$D$14","v":0}]
[{"$f":"参加申込書Ｂ!A8","v":0},{"$f":"参加申込書Ｂ!B8","v":0},{"$f":"参加申込書Ｂ!C8","v":0},{"$f":"参加申込書Ｂ!D8","v":0},{"$f":"参加申込書Ｂ!E8","v":0},{"$f":"参加申込書Ｂ!F8","v":0},{"$f":"参加申込書Ｂ!G8","v":0},{"$f":"参加申込書Ｂ!H8","v":0},{"$f":"参加申込書Ｂ!I8","v":0},{"$f":"参加申込書Ｂ!J8","v":0},{"$f":"参加申込書Ｂ!K8","v":0},{"$f":"参加申込書Ｂ!L8","v":0},{"$f":"参加申込書Ｂ!M8","v":0},{"$f":"出品票作成!$B$6","v":"選択"},{"$f":"参加申込書Ａ!$E$1","v":0},{"$f":"参加申込書Ａ!$B$6","v":"選択してください"},{"$f":"参加申込書Ａ!$B$9","v":"自動入力（上書入力可）"},{"$f":"参加申込書Ａ!$D$9","v":"自動入力（上書入力可）"},{"$f":"参加申込書Ａ!$B$8","v":0},{"$f":"参加申込書Ａ!$B$12","v":0},{"$f":"参加申込書Ａ!$C$12","v":0},{"$f":"参加申込書Ａ!$D$12","v":0},{"$f":"参加申込書Ａ!$B$13","v":0},{"$f":"参加申込書Ａ!$C$13","v":0},{"$f":"参加申込書Ａ!$D$13","v":0},{"$f":"参加申込書Ａ!$B$14","v":0},{"$f":"参加申込書Ａ!$C$14","v":0},{"$f":"参加申込書Ａ!$D$14","v":0}]
[{"$f":"参加申込書Ｂ!A9","v":0},{"$f":"参加申込書Ｂ!B9","v":0},{"$f":"参加申込書Ｂ!C9","v":0},{"$f":"参加申込書Ｂ!D9","v":0},{"$f":"参加申込書Ｂ!E9","v":0},{"$f":"参加申込書Ｂ!F9","v":0},{"$f":"参加申込書Ｂ!G9","v":0},{"$f":"参加申込書Ｂ!H9","v":0},{"$f":"参加申込書Ｂ!I9","v":0},{"$f":"参加申込書Ｂ!J9","v":0},{"$f":"参加申込書Ｂ!K9","v":0},{"$f":"参加申込書Ｂ!L9","v":0},{"$f":"参加申込書Ｂ!M9","v":0},{"$f":"出品票作成!$B$6","v":"選択"},{"$f":"参加申込書Ａ!$E$1","v":0},{"$f":"参加申込書Ａ!$B$6","v":"選択してください"},{"$f":"参加申込書Ａ!$B$9","v":"自動入力（上書入力可）"},{"$f":"参加申込書Ａ!$D$9","v":"自動入力（上書入力可）"},{"$f":"参加申込書Ａ!$B$8","v":0},{"$f":"参加申込書Ａ!$B$12","v":0},{"$f":"参加申込書Ａ!$C$12","v":0},{"$f":"参加申込書Ａ!$D$12","v":0},{"$f":"参加申込書Ａ!$B$13","v":0},{"$f":"参加申込書Ａ!$C$13","v":0},{"$f":"参加申込書Ａ!$D$13","v":0},{"$f":"参加申込書Ａ!$B$14","v":0},{"$f":"参加申込書Ａ!$C$14","v":0},{"$f":"参加申込書Ａ!$D$14","v":0}]
[{"$f":"参加申込書Ｂ!A10","v":0},{"$f":"参加申込書Ｂ!B10","v":0},{"$f":"参加申込書Ｂ!C10","v":0},{"$f":"参加申込書Ｂ!D10","v":0},{"$f":"参加申込書Ｂ!E10","v":0},{"$f":"参加申込書Ｂ!F10","v":0},{"$f":"参加申込書Ｂ!G10","v":0},{"$f":"参加申込書Ｂ!H10","v":0},{"$f":"参加申込書Ｂ!I10","v":0},{"$f":"参加申込書Ｂ!J10","v":0},{"$f":"参加申込書Ｂ!K10","v":0},{"$f":"参加申込書Ｂ!L10","v":0},{"$f":"参加申込書Ｂ!M10","v":0},{"$f":"出品票作成!$B$6","v":"選択"},{"$f":"参加申込書Ａ!$E$1","v":0},{"$f":"参加申込書Ａ!$B$6","v":"選択してください"},{"$f":"参加申込書Ａ!$B$9","v":"自動入力（上書入力可）"},{"$f":"参加申込書Ａ!$D$9","v":"自動入力（上書入力可）"},{"$f":"参加申込書Ａ!$B$8","v":0},{"$f":"参加申込書Ａ!$B$12","v":0},{"$f":"参加申込書Ａ!$C$12","v":0},{"$f":"参加申込書Ａ!$D$12","v":0},{"$f":"参加申込書Ａ!$B$13","v":0},{"$f":"参加申込書Ａ!$C$13","v":0},{"$f":"参加申込書Ａ!$D$13","v":0},{"$f":"参加申込書Ａ!$B$14","v":0},{"$f":"参加申込書Ａ!$C$14","v":0},{"$f":"参加申込書Ａ!$D$14","v":0}]
[{"$f":"参加申込書Ｂ!A11","v":0},{"$f":"参加申込書Ｂ!B11","v":0},{"$f":"参加申込書Ｂ!C11","v":0},{"$f":"参加申込書Ｂ!D11","v":0},{"$f":"参加申込書Ｂ!E11","v":0},{"$f":"参加申込書Ｂ!F11","v":0},{"$f":"参加申込書Ｂ!G11","v":0},{"$f":"参加申込書Ｂ!H11","v":0},{"$f":"参加申込書Ｂ!I11","v":0},{"$f":"参加申込書Ｂ!J11","v":0},{"$f":"参加申込書Ｂ!K11","v":0},{"$f":"参加申込書Ｂ!L11","v":0},{"$f":"参加申込書Ｂ!M11","v":0},{"$f":"出品票作成!$B$6","v":"選択"},{"$f":"参加申込書Ａ!$E$1","v":0},{"$f":"参加申込書Ａ!$B$6","v":"選択してください"},{"$f":"参加申込書Ａ!$B$9","v":"自動入力（上書入力可）"},{"$f":"参加申込書Ａ!$D$9","v":"自動入力（上書入力可）"},{"$f":"参加申込書Ａ!$B$8","v":0},{"$f":"参加申込書Ａ!$B$12","v":0},{"$f":"参加申込書Ａ!$C$12","v":0},{"$f":"参加申込書Ａ!$D$12","v":0},{"$f":"参加申込書Ａ!$B$13","v":0},{"$f":"参加申込書Ａ!$C$13","v":0},{"$f":"参加申込書Ａ!$D$13","v":0},{"$f":"参加申込書Ａ!$B$14","v":0},{"$f":"参加申込書Ａ!$C$14","v":0},{"$f":"参加申込書Ａ!$D$14","v":0}]
[{"$f":"参加申込書Ｂ!A12","v":0},{"$f":"参加申込書Ｂ!B12","v":0},{"$f":"参加申込書Ｂ!C12","v":0},{"$f":"参加申込書Ｂ!D12","v":0},{"$f":"参加申込書Ｂ!E12","v":0},{"$f":"参加申込書Ｂ!F12","v":0},{"$f":"参加申込書Ｂ!G12","v":0},{"$f":"参加申込書Ｂ!H12","v":0},{"$f":"参加申込書Ｂ!I12","v":0},{"$f":"参加申込書Ｂ!J12","v":0},{"$f":"参加申込書Ｂ!K12","v":0},{"$f":"参加申込書Ｂ!L12","v":0},{"$f":"参加申込書Ｂ!M12","v":0},{"$f":"出品票作成!$B$6","v":"選択"},{"$f":"参加申込書Ａ!$E$1","v":0},{"$f":"参加申込書Ａ!$B$6","v":"選択してください"},{"$f":"参加申込書Ａ!$B$9","v":"自動入力（上書入力可）"},{"$f":"参加申込書Ａ!$D$9","v":"自動入力（上書入力可）"},{"$f":"参加申込書Ａ!$B$8","v":0},{"$f":"参加申込書Ａ!$B$12","v":0},{"$f":"参加申込書Ａ!$C$12","v":0},{"$f":"参加申込書Ａ!$D$12","v":0},{"$f":"参加申込書Ａ!$B$13","v":0},{"$f":"参加申込書Ａ!$C$13","v":0},{"$f":"参加申込書Ａ!$D$13","v":0},{"$f":"参加申込書Ａ!$B$14","v":0},{"$f":"参加申込書Ａ!$C$14","v":0},{"$f":"参加申込書Ａ!$D$14","v":0}]
[{"$f":"参加申込書Ｂ!A13","v":0},{"$f":"参加申込書Ｂ!B13","v":0},{"$f":"参加申込書Ｂ!C13","v":0},{"$f":"参加申込書Ｂ!D13","v":0},{"$f":"参加申込書Ｂ!E13","v":0},{"$f":"参加申込書Ｂ!F13","v":0},{"$f":"参加申込書Ｂ!G13","v":0},{"$f":"参加申込書Ｂ!H13","v":0},{"$f":"参加申込書Ｂ!I13","v":0},{"$f":"参加申込書Ｂ!J13","v":0},{"$f":"参加申込書Ｂ!K13","v":0},{"$f":"参加申込書Ｂ!L13","v":0},{"$f":"参加申込書Ｂ!M13","v":0},{"$f":"出品票作成!$B$6","v":"選択"},{"$f":"参加申込書Ａ!$E$1","v":0},{"$f":"参加申込書Ａ!$B$6","v":"選択してください"},{"$f":"参加申込書Ａ!$B$9","v":"自動入力（上書入力可）"},{"$f":"参加申込書Ａ!$D$9","v":"自動入力（上書入力可）"},{"$f":"参加申込書Ａ!$B$8","v":0},{"$f":"参加申込書Ａ!$B$12","v":0},{"$f":"参加申込書Ａ!$C$12","v":0},{"$f":"参加申込書Ａ!$D$12","v":0},{"$f":"参加申込書Ａ!$B$13","v":0},{"$f":"参加申込書Ａ!$C$13","v":0},{"$f":"参加申込書Ａ!$D$13","v":0},{"$f":"参加申込書Ａ!$B$14","v":0},{"$f":"参加申込書Ａ!$C$14","v":0},{"$f":"参加申込書Ａ!$D$14","v":0}]
[{"$f":"参加申込書Ｂ!A14","v":0},{"$f":"参加申込書Ｂ!B14","v":0},{"$f":"参加申込書Ｂ!C14","v":0},{"$f":"参加申込書Ｂ!D14","v":0},{"$f":"参加申込書Ｂ!E14","v":0},{"$f":"参加申込書Ｂ!F14","v":0},{"$f":"参加申込書Ｂ!G14","v":0},{"$f":"参加申込書Ｂ!H14","v":0},{"$f":"参加申込書Ｂ!I14","v":0},{"$f":"参加申込書Ｂ!J14","v":0},{"$f":"参加申込書Ｂ!K14","v":0},{"$f":"参加申込書Ｂ!L14","v":0},{"$f":"参加申込書Ｂ!M14","v":0},{"$f":"出品票作成!$B$6","v":"選択"},{"$f":"参加申込書Ａ!$E$1","v":0},{"$f":"参加申込書Ａ!$B$6","v":"選択してください"},{"$f":"参加申込書Ａ!$B$9","v":"自動入力（上書入力可）"},{"$f":"参加申込書Ａ!$D$9","v":"自動入力（上書入力可）"},{"$f":"参加申込書Ａ!$B$8","v":0},{"$f":"参加申込書Ａ!$B$12","v":0},{"$f":"参加申込書Ａ!$C$12","v":0},{"$f":"参加申込書Ａ!$D$12","v":0},{"$f":"参加申込書Ａ!$B$13","v":0},{"$f":"参加申込書Ａ!$C$13","v":0},{"$f":"参加申込書Ａ!$D$13","v":0},{"$f":"参加申込書Ａ!$B$14","v":0},{"$f":"参加申込書Ａ!$C$14","v":0},{"$f":"参加申込書Ａ!$D$14","v":0}]
[{"$f":"参加申込書Ｂ!A15","v":0},{"$f":"参加申込書Ｂ!B15","v":0},{"$f":"参加申込書Ｂ!C15","v":0},{"$f":"参加申込書Ｂ!D15","v":0},{"$f":"参加申込書Ｂ!E15","v":0},{"$f":"参加申込書Ｂ!F15","v":0},{"$f":"参加申込書Ｂ!G15","v":0},{"$f":"参加申込書Ｂ!H15","v":0},{"$f":"参加申込書Ｂ!I15","v":0},{"$f":"参加申込書Ｂ!J15","v":0},{"$f":"参加申込書Ｂ!K15","v":0},{"$f":"参加申込書Ｂ!L15","v":0},{"$f":"参加申込書Ｂ!M15","v":0},{"$f":"出品票作成!$B$6","v":"選択"},{"$f":"参加申込書Ａ!$E$1","v":0},{"$f":"参加申込書Ａ!$B$6","v":"選択してください"},{"$f":"参加申込書Ａ!$B$9","v":"自動入力（上書入力可）"},{"$f":"参加申込書Ａ!$D$9","v":"自動入力（上書入力可）"},{"$f":"参加申込書Ａ!$B$8","v":0},{"$f":"参加申込書Ａ!$B$12","v":0},{"$f":"参加申込書Ａ!$C$12","v":0},{"$f":"参加申込書Ａ!$D$12","v":0},{"$f":"参加申込書Ａ!$B$13","v":0},{"$f":"参加申込書Ａ!$C$13","v":0},{"$f":"参加申込書Ａ!$D$13","v":0},{"$f":"参加申込書Ａ!$B$14","v":0},{"$f":"参加申込書Ａ!$C$14","v":0},{"$f":"参加申込書Ａ!$D$14","v":0}]
[{"$f":"参加申込書Ｂ!A16","v":0},{"$f":"参加申込書Ｂ!B16","v":0},{"$f":"参加申込書Ｂ!C16","v":0},{"$f":"参加申込書Ｂ!D16","v":0},{"$f":"参加申込書Ｂ!E16","v":0},{"$f":"参加申込書Ｂ!F16","v":0},{"$f":"参加申込書Ｂ!G16","v":0},{"$f":"参加申込書Ｂ!H16","v":0},{"$f":"参加申込書Ｂ!I16","v":0},{"$f":"参加申込書Ｂ!J16","v":0},{"$f":"参加申込書Ｂ!K16","v":0},{"$f":"参加申込書Ｂ!L16","v":0},{"$f":"参加申込書Ｂ!M16","v":0},{"$f":"出品票作成!$B$6","v":"選択"},{"$f":"参加申込書Ａ!$E$1","v":0},{"$f":"参加申込書Ａ!$B$6","v":"選択してください"},{"$f":"参加申込書Ａ!$B$9","v":"自動入力（上書入力可）"},{"$f":"参加申込書Ａ!$D$9","v":"自動入力（上書入力可）"},{"$f":"参加申込書Ａ!$B$8","v":0},{"$f":"参加申込書Ａ!$B$12","v":0},{"$f":"参加申込書Ａ!$C$12","v":0},{"$f":"参加申込書Ａ!$D$12","v":0},{"$f":"参加申込書Ａ!$B$13","v":0},{"$f":"参加申込書Ａ!$C$13","v":0},{"$f":"参加申込書Ａ!$D$13","v":0},{"$f":"参加申込書Ａ!$B$14","v":0},{"$f":"参加申込書Ａ!$C$14","v":0},{"$f":"参加申込書Ａ!$D$14","v":0}]
[{"$f":"参加申込書Ｂ!A17","v":0},{"$f":"参加申込書Ｂ!B17","v":0},{"$f":"参加申込書Ｂ!C17","v":0},{"$f":"参加申込書Ｂ!D17","v":0},{"$f":"参加申込書Ｂ!E17","v":0},{"$f":"参加申込書Ｂ!F17","v":0},{"$f":"参加申込書Ｂ!G17","v":0},{"$f":"参加申込書Ｂ!H17","v":0},{"$f":"参加申込書Ｂ!I17","v":0},{"$f":"参加申込書Ｂ!J17","v":0},{"$f":"参加申込書Ｂ!K17","v":0},{"$f":"参加申込書Ｂ!L17","v":0},{"$f":"参加申込書Ｂ!M17","v":0},{"$f":"出品票作成!$B$6","v":"選択"},{"$f":"参加申込書Ａ!$E$1","v":0},{"$f":"参加申込書Ａ!$B$6","v":"選択してください"},{"$f":"参加申込書Ａ!$B$9","v":"自動入力（上書入力可）"},{"$f":"参加申込書Ａ!$D$9","v":"自動入力（上書入力可）"},{"$f":"参加申込書Ａ!$B$8","v":0},{"$f":"参加申込書Ａ!$B$12","v":0},{"$f":"参加申込書Ａ!$C$12","v":0},{"$f":"参加申込書Ａ!$D$12","v":0},{"$f":"参加申込書Ａ!$B$13","v":0},{"$f":"参加申込書Ａ!$C$13","v":0},{"$f":"参加申込書Ａ!$D$13","v":0},{"$f":"参加申込書Ａ!$B$14","v":0},{"$f":"参加申込書Ａ!$C$14","v":0},{"$f":"参加申込書Ａ!$D$14","v":0}]
[{"$f":"参加申込書Ｂ!A18","v":0},{"$f":"参加申込書Ｂ!B18","v":0},{"$f":"参加申込書Ｂ!C18","v":0},{"$f":"参加申込書Ｂ!D18","v":0},{"$f":"参加申込書Ｂ!E18","v":0},{"$f":"参加申込書Ｂ!F18","v":0},{"$f":"参加申込書Ｂ!G18","v":0},{"$f":"参加申込書Ｂ!H18","v":0},{"$f":"参加申込書Ｂ!I18","v":0},{"$f":"参加申込書Ｂ!J18","v":0},{"$f":"参加申込書Ｂ!K18","v":0},{"$f":"参加申込書Ｂ!L18","v":0},{"$f":"参加申込書Ｂ!M18","v":0},{"$f":"出品票作成!$B$6","v":"選択"},{"$f":"参加申込書Ａ!$E$1","v":0},{"$f":"参加申込書Ａ!$B$6","v":"選択してください"},{"$f":"参加申込書Ａ!$B$9","v":"自動入力（上書入力可）"},{"$f":"参加申込書Ａ!$D$9","v":"自動入力（上書入力可）"},{"$f":"参加申込書Ａ!$B$8","v":0},{"$f":"参加申込書Ａ!$B$12","v":0},{"$f":"参加申込書Ａ!$C$12","v":0},{"$f":"参加申込書Ａ!$D$12","v":0},{"$f":"参加申込書Ａ!$B$13","v":0},{"$f":"参加申込書Ａ!$C$13","v":0},{"$f":"参加申込書Ａ!$D$13","v":0},{"$f":"参加申込書Ａ!$B$14","v":0},{"$f":"参加申込書Ａ!$C$14","v":0},{"$f":"参加申込書Ａ!$D$14","v":0}]
{"$rows_left_out":16}
{"sheet":"summary (2)","index":9,"n_rows":4,"n_cols":16,"rows_kept":4,"cut":false,"hidden":false,"merged":[]}
["学校名","指導教員","氏名","メールアドレス","携帯、スマホ","講評会講師","(金)9:00～17:00(搬入)","(土)9:00～11:00(受付)","(土)11:00～13:0(受付)","(土)13:00～15:00(受付)","(土)15:00～17:00(受付)","(日)9:00～11:00(受付)","(日)11:00～13:00(受付)","(日)13:00～15:00(受付)","(日)15:00～17:00(搬出)","備考"]
[{"$f":"参加申込書Ａ!$B$6","v":"選択してください"},{"$f":"参加申込書Ａ!A12","v":"1（主顧問：必須）"},{"$f":"参加申込書Ａ!B12","v":0},{"$f":"参加申込書Ａ!C12","v":0},{"$f":"参加申込書Ａ!D12","v":0},{"$f":"運営要員調査票!C4","v":0},{"$f":"運営要員調査票!D4","v":0},{"$f":"運営要員調査票!E4","v":0},{"$f":"運営要員調査票!F4","v":0},{"$f":"運営要員調査票!G4","v":0},{"$f":"運営要員調査票!H4","v":0},{"$f":"運営要員調査票!I4","v":0},{"$f":"運営要員調査票!J4","v":0},{"$f":"運営要員調査票!K4","v":0},{"$f":"運営要員調査票!L4","v":0},{"$f":"運営要員調査票!M4","v":0}]
[{"$f":"参加申込書Ａ!$B$6","v":"選択してください"},{"$f":"参加申込書Ａ!A13","v":"2（副顧問：任意）"},{"$f":"参加申込書Ａ!B13","v":0},{"$f":"参加申込書Ａ!C13","v":0},{"$f":"参加申込書Ａ!D13","v":0},{"$f":"運営要員調査票!C5","v":0},{"$f":"運営要員調査票!D5","v":0},{"$f":"運営要員調査票!E5","v":0},{"$f":"運営要員調査票!F5","v":0},{"$f":"運営要員調査票!G5","v":0},{"$f":"運営要員調査票!H5","v":0},{"$f":"運営要員調査票!I5","v":0},{"$f":"運営要員調査票!J5","v":0},{"$f":"運営要員調査票!K5","v":0},{"$f":"運営要員調査票!L5","v":0},{"$f":"運営要員調査票!M5","v":0}]
[{"$f":"参加申込書Ａ!$B$6","v":"選択してください"},{"$f":"参加申込書Ａ!A14","v":"3（副顧問：任意）"},{"$f":"参加申込書Ａ!B14","v":0},{"$f":"参加申込書Ａ!C14","v":0},{"$f":"参加申込書Ａ!D14","v":0},{"$f":"運営要員調査票!C6","v":0},{"$f":"運営要員調査票!D6","v":0},{"$f":"運営要員調査票!E6","v":0},{"$f":"運営要員調査票!F6","v":0},{"$f":"運営要員調査票!G6","v":0},{"$f":"運営要員調査票!H6","v":0},{"$f":"運営要員調査票!I6","v":0},{"$f":"運営要員調査票!J6","v":0},{"$f":"運営要員調査票!K6","v":0},{"$f":"運営要員調査票!L6","v":0},{"$f":"運営要員調査票!M6","v":0}]